Target
M-phase inducer phosphatase 2
Ligand
BDBM50504064
Substrate
Meas. Tech.
ChEMBL_1813305 (CHEMBL4312879)
Ki
800±n/a nM
Citation
 Cerchia, CNasso, RMori, MVilla, SGelain, ACapasso, AAliotta, FSimonetti, MRullo, RMasullo, MDe Vendittis, ERuocco, MRLavecchia, A Discovery of Novel Naphthylphenylketone and Naphthylphenylamine Derivatives as Cell Division Cycle 25B (CDC25B) Phosphatase Inhibitors: Design, Synthesis, Inhibition Mechanism, and in Vitro Efficacy against Melanoma Cell Lines. J Med Chem 62:7089-7110 (2019)  
Target
Name:
M-phase inducer phosphatase 2
Synonyms:
CDC25B Dual specificity phosphatase (CDC25B) M-phase inducer phosphatase 2 (CDC25B) | MPIP2_HUMAN
Type:
Protein
Mol. Mass.:
64985.27
Organism:
Homo sapiens (Human)
Description:
Residue:
580
  
Inhibitor
Name:
BDBM50504064
Synonyms:
CHEMBL4438316
Type:
Small organic molecule
Emp. Form.:
C17H15ClN2O2
Mol. Mass.:
314.766
SMILES:
Cl.Nc1cccc2c(Nc3cccc(c3)C(O)=O)cccc12
: