Target
M-phase inducer phosphatase 2
Ligand
BDBM50504066
Substrate
Meas. Tech.
ChEMBL_1813305 (CHEMBL4312879)
Ki
7400±n/a nM
Citation
 Cerchia, CNasso, RMori, MVilla, SGelain, ACapasso, AAliotta, FSimonetti, MRullo, RMasullo, MDe Vendittis, ERuocco, MRLavecchia, A Discovery of Novel Naphthylphenylketone and Naphthylphenylamine Derivatives as Cell Division Cycle 25B (CDC25B) Phosphatase Inhibitors: Design, Synthesis, Inhibition Mechanism, and in Vitro Efficacy against Melanoma Cell Lines. J Med Chem 62:7089-7110 (2019)  
Target
Name:
M-phase inducer phosphatase 2
Synonyms:
CDC25B Dual specificity phosphatase (CDC25B) M-phase inducer phosphatase 2 (CDC25B) | MPIP2_HUMAN
Type:
Protein
Mol. Mass.:
64985.27
Organism:
Homo sapiens (Human)
Description:
Residue:
580
  
Inhibitor
Name:
BDBM50504066
Synonyms:
CHEMBL4566865
Type:
Small organic molecule
Emp. Form.:
C19H17NO3
Mol. Mass.:
307.3432
SMILES:
CCOC(=O)c1ccccc1Nc1cccc2c(O)cccc12
: