Target
M-phase inducer phosphatase 2
Ligand
BDBM26617
Substrate
Meas. Tech.
ChEMBL_1813330 (CHEMBL4312904)
Ki
5300±n/a nM
Citation
 Cerchia, CNasso, RMori, MVilla, SGelain, ACapasso, AAliotta, FSimonetti, MRullo, RMasullo, MDe Vendittis, ERuocco, MRLavecchia, A Discovery of Novel Naphthylphenylketone and Naphthylphenylamine Derivatives as Cell Division Cycle 25B (CDC25B) Phosphatase Inhibitors: Design, Synthesis, Inhibition Mechanism, and in Vitro Efficacy against Melanoma Cell Lines. J Med Chem 62:7089-7110 (2019)  
Target
Name:
M-phase inducer phosphatase 2
Synonyms:
CDC25B Dual specificity phosphatase (CDC25B) M-phase inducer phosphatase 2 (CDC25B) | MPIP2_HUMAN
Type:
Protein
Mol. Mass.:
64985.27
Organism:
Homo sapiens (Human)
Description:
Residue:
580
  
Inhibitor
Name:
BDBM26617
Synonyms:
4-[(2-carboxyphenyl)carbonyl]benzene-1,2-dicarboxylic acid | Compound 28620
Type:
Small organic molecule
Emp. Form.:
C16H10O7
Mol. Mass.:
314.2464
SMILES:
OC(=O)c1ccccc1C(=O)c1ccc(C(O)=O)c(c1)C(O)=O
: