Target
5-hydroxytryptamine receptor 7
Ligand
BDBM50139355
Substrate
Meas. Tech.
ChEMBL_1813998 (CHEMBL4313572)
Ki
0.600000±n/a nM
Citation
 Romeo, GSalerno, LPittalą, VCandido, MIntagliata, SAmata, ESalmona, MCagnotto, ARescifina, AFloresta, GModica, MN [1]Benzothieno[3,2-d]pyrimidine derivatives as ligands for the serotonergic 5-HT Eur J Med Chem 183:0 (2019)  
Target
Name:
5-hydroxytryptamine receptor 7
Synonyms:
5-HT-7 5-HT7 5-HT7S 5HT7 HTR7 | Serotonin receptor 7
Type:
G Protein-Coupled Receptor (GPCR)
Mol. Mass.:
53573.08
Organism:
Homo sapiens (Human)
Description:
P34969
Residue:
479
  
Inhibitor
Name:
BDBM50139355
Synonyms:
2-(6-Phenylpyridin-2-ylthio)-N,N-dimethylethan-amine Dimethyl-[2-(6-phenyl-pyridin-2-ylsulfanyl)-ethyl]-amine
Type:
Small organic molecule
Emp. Form.:
C15H18N2S
Mol. Mass.:
258.382
SMILES:
CN(C)CCSc1cccc(n1)-c1ccccc1
: