Target
Chymotrypsinogen B2
Ligand
BDBM50504368
Substrate
Meas. Tech.
ChEMBL_1814630 (CHEMBL4314204)
Ki
12378±n/a nM
Citation
 Chen, PZhang, DLi, MWu, QLam, YPYGuo, YChen, CBai, NMalhotra, SLi, WO'Connor, PBFu, H Discovery of novel, potent, isosteviol-based antithrombotic agents. Eur J Med Chem 183:0 (2019)  
Target
Name:
Chymotrypsinogen B2
Synonyms:
3.4.21.1 CTRB2_HUMAN Chymotrypsin B2 chain B Chymotrypsinogen B2
Type:
PROTEIN
Mol. Mass.:
27926.36
Organism:
Homo sapiens
Description:
ChEMBL_119704
Residue:
263
  
Inhibitor
Name:
BDBM50504368
Synonyms:
CHEMBL4435573
Type:
Small organic molecule
Emp. Form.:
C27H43NO4
Mol. Mass.:
445.6346
SMILES:
[H][C@@]12CC[C@@]3(C)C[C@@]1(C\C3=N/OCC1(C)COC1)CC[C@]1([H])[C@@](C)(CCC[C@@]21C)C(=O)OCC
: