Target
RNA-directed RNA polymerase
Ligand
BDBM50504502
Substrate
Meas. Tech.
ChEMBL_1814874 (CHEMBL4314448)
IC50
120±n/a nM
Citation
 Hassan, GSGeorgey, HHMohammed, EZOmar, FA Anti-hepatitis-C virus activity and QSAR study of certain thiazolidinone and thiazolotriazine derivatives as potential NS5B polymerase inhibitors. Eur J Med Chem 184:0 (2019)  
Target
Name:
RNA-directed RNA polymerase
Synonyms:
Hepatitis C virus NS5B RNA-dependent RNA polymerase | NS5B protein
Type:
Protein
Mol. Mass.:
25173.95
Organism:
Hepatitis C virus
Description:
Q8JXU8
Residue:
229
  
Inhibitor
Name:
BDBM50504502
Synonyms:
CHEMBL4475793
Type:
Small organic molecule
Emp. Form.:
C18H14ClN3OS
Mol. Mass.:
355.841
SMILES:
Clc1ccc(\C=c2\sc3=NCN(Cn3c2=O)c2ccccc2)cc1
: