Target
RNA-directed RNA polymerase
Ligand
BDBM50504487
Substrate
Meas. Tech.
ChEMBL_1814874 (CHEMBL4314448)
IC50
619±n/a nM
Citation
 Hassan, GSGeorgey, HHMohammed, EZOmar, FA Anti-hepatitis-C virus activity and QSAR study of certain thiazolidinone and thiazolotriazine derivatives as potential NS5B polymerase inhibitors. Eur J Med Chem 184:0 (2019)  
Target
Name:
RNA-directed RNA polymerase
Synonyms:
Hepatitis C virus NS5B RNA-dependent RNA polymerase | NS5B protein
Type:
Protein
Mol. Mass.:
25173.95
Organism:
Hepatitis C virus
Description:
Q8JXU8
Residue:
229
  
Inhibitor
Name:
BDBM50504487
Synonyms:
CHEMBL4594122
Type:
Small organic molecule
Emp. Form.:
C18H15N3OS
Mol. Mass.:
321.396
SMILES:
O=c1n2CN(CN=c2s\c1=C\c1ccccc1)c1ccccc1
: