Target
Alpha-2B adrenergic receptor
Ligand
BDBM50055830
Substrate
Meas. Tech.
ChEMBL_33375 (CHEMBL648737)
EC50
470±n/a nM
Citation
 Munk, SAHarcourt, DAArasasingham, PNBurke, JAKharlamb, ABManlapaz, CAPadillo, EURoberts, DRunde, EWilliams, LWheeler, LAGarst, ME Synthesis and evaluation of 2-(arylamino)imidazoles as alpha 2-adrenergic agonists. J Med Chem 40:18-23 (1997)  
Target
Name:
Alpha-2B adrenergic receptor
Synonyms:
ADA2B_RAT Adrenergic receptor alpha Alpha-2B adrenergic receptor Alpha-2B adrenoreceptor | adrenergic Alpha2B
Type:
Enzyme Catalytic Domain
Mol. Mass.:
50379.83
Organism:
NEONATAL RAT
Description:
adrenergic Alpha2B ADRA2B NEONATAL RAT::P19328
Residue:
453
  
Inhibitor
Name:
BDBM50055830
Synonyms:
(1H-Imidazol-2-yl)-(5-methyl-3,4-dihydro-2H-benzo[1,4]oxazin-6-yl)-amine | CHEMBL432155
Type:
Small organic molecule
Emp. Form.:
C12H14N4O
Mol. Mass.:
230.2658
SMILES:
Cc1c(Nc2ncc[nH]2)ccc2OCCNc12
: