Target
5-hydroxytryptamine receptor 6
Ligand
BDBM50504839
Substrate
Meas. Tech.
ChEMBL_1816837 (CHEMBL4316411)
Ki
2.0±n/a nM
Citation
 Staro?, JKurczab, RWarszycki, DSata?a, GKrawczyk, MBugno, RLenda, TPopik, PHogendorf, ASHogendorf, ADubiel, KMat?oka, MMoszczy?ski-P?tkowski, RPieczykolan, JWieczorek, MZajdel, PBojarski, AJ Virtual screening-driven discovery of dual 5-HT Eur J Med Chem 185:0 (2020)  
Target
Name:
5-hydroxytryptamine receptor 6
Synonyms:
5-HT-6 5-hydroxytryptamine receptor 6 (5-HT-6) 5-hydroxytryptamine receptor 6 (5HT6) HTR6 Serotonin 6 (5-HT6) receptor | Serotonin Receptor 6
Type:
G Protein-Coupled Receptor (GPCR)
Mol. Mass.:
46968.43
Organism:
Homo sapiens (Human)
Description:
P50406
Residue:
440
  
Inhibitor
Name:
BDBM50504839
Synonyms:
CHEMBL4584504
Type:
Small organic molecule
Emp. Form.:
C21H19FN2O2
Mol. Mass.:
350.3862
SMILES:
Oc1ccc(cc1)-c1ccc(CNCCc2c[nH]c3cc(F)ccc23)o1
: