Target
BDNF/NT-3 growth factors receptor
Ligand
BDBM50505013
Substrate
Meas. Tech.
ChEMBL_1816968 (CHEMBL4316542)
EC50
610±n/a nM
Citation
 Kargbo, RB Modulation of Tropomyosin Receptor Kinase for the Treatment of Neurotrophin Diseases: Alzheimer's, Huntington's and Parkinson's. ACS Med Chem Lett 10:1590-1591 (2019)  
Target
Name:
BDNF/NT-3 growth factors receptor
Synonyms:
GP145-TrkB NTRK2 Neurotrophic tyrosine kinase receptor type 2 Trk-B Tropomyosin-related kinase B Tyrosine kinase receptor B (Trk-B)
Type:
Enzyme
Mol. Mass.:
91996.87
Organism:
Homo sapiens (Human)
Description:
Q16620
Residue:
822
  
Inhibitor
Name:
BDBM50505013
Synonyms:
CHEMBL4574315
Type:
Small organic molecule
Emp. Form.:
C20H19N3O6
Mol. Mass.:
397.3814
SMILES:
Cn1c(=O)[nH]c(=O)n(-c2ccc(Oc3ccccc3)c(OCC3COC3)c2)c1=O
: