Target
DNA topoisomerase 2-alpha/2-beta
Ligand
BDBM50033731
Substrate
Meas. Tech.
ChEMBL_1821487 (CHEMBL4321147)
IC50
7800±n/a nM
Citation
 Liu, YLiang, YJiang, JQin, QWang, LLiu, X Design, synthesis and biological evaluation of 1,4-dihydroxyanthraquinone derivatives as anticancer agents. Bioorg Med Chem Lett 29:1120-1126 (2019)  
Target
Name:
DNA topoisomerase 2-alpha/2-beta
Synonyms:
DNA topoisomerase II
Type:
Mol. Mass.:
Description:
ASSAY_ID of ChEMBL is 1821483
Components:
This complex has 2 components.
Component 1
Name:
DNA topoisomerase 2-alpha
Synonyms:
DNA topoisomerase 2-alpha DNA topoisomerase II (Topo II) DNA topoisomerase II, alpha isozyme TOP2A Topoisomerase I/II | Topoisomerase II alpha (HuTopoIIα)
Type:
Protein
Mol. Mass.:
174415.30
Organism:
Homo sapiens (Human)
Description:
P11388
Residue:
1531
  
Component 2
Name:
DNA topoisomerase 2-beta
Synonyms:
DNA topoisomerase II TOP2B | TOP2B_HUMAN
Type:
PROTEIN
Mol. Mass.:
183284.13
Organism:
Homo sapiens (Human)
Description:
ChEMBL_51583
Residue:
1626
  
Inhibitor
Name:
BDBM50033731
Synonyms:
(R)-5,8-dihydroxy-2-(1-hydroxy-4-methylpent-3-enyl)naphthalene-1,4-dione 5,8-Dihydroxy-2-(1-hydroxy-4-methyl-pent-3-enyl)-[1,4]naphthoquinone Shikonin
Type:
Small organic molecule
Emp. Form.:
C16H16O5
Mol. Mass.:
288.2952
SMILES:
CC(C)C=CC(=O)c1cc(O)c2c(O)ccc(O)c2c1O
: