Target
Monoacylglycerol lipase ABHD6
Ligand
BDBM50052768
Substrate
Meas. Tech.
ChEMBL_1821758 (CHEMBL4321418)
IC50
<10.0±n/a nM
Citation
 Otrubova, KChatterjee, SGhimire, SCravatt, BFBoger, DL N-Acyl pyrazoles: Effective and tunable inhibitors of serine hydrolases. Bioorg Med Chem 27:1693-1703 (2019)  
Target
Name:
Monoacylglycerol lipase ABHD6
Synonyms:
ABHD6_MOUSE Abhd6 Monoacylglycerol lipase ABHD6
Type:
Single-pass type II membrane protein; hydrolase
Mol. Mass.:
38216.17
Organism:
Mus musculus (mouse)
Description:
Assays were using membranes of recombinant Abh6 transiently transfected in COS-7 cells.
Residue:
336
  
Inhibitor
Name:
BDBM50052768
Synonyms:
CHEMBL3318613
Type:
Small organic molecule
Emp. Form.:
C23H23N5O2
Mol. Mass.:
401.461
SMILES:
O=C(N1CCN(Cc2ccc(OCc3ccccc3)cc2)CC1)n1cc(cn1)C#N
: