Target
Sodium-dependent dopamine transporter
Ligand
BDBM22199
Substrate
Meas. Tech.
ChEMBL_62174 (CHEMBL672113)
IC50
11±n/a nM
Citation
 Matecka, DLewis, DRothman, RBDersch, CMWojnicki, FHGlowa, JRDeVries, ACPert, ARice, KC Heteroaromatic analogs of 1-[2-(diphenylmethoxy)ethyl]- and 1-[2-[bis(4-fluorophenyl)methoxy]ethyl]-4-(3-phenylpropyl)piperazines (GBR 12935 and GBR 12909) as high-affinity dopamine reuptake inhibitors. J Med Chem 40:705-16 (1997)  
Target
Name:
Sodium-dependent dopamine transporter
Synonyms:
DA transporter SC6A3_RAT Sodium-dependent dopamine transporter | Sodium-dependent dopamine transporter (DAT)
Type:
Multi-pass membrane protein
Mol. Mass.:
68749.45
Organism:
Rattus norvegicus (rat)
Description:
P23977
Residue:
619
  
Inhibitor
Name:
BDBM22199
Synonyms:
1-{2-[bis(4-fluorophenyl)methoxy]ethyl}-4-[(2E)-3-phenylprop-2-en-1-yl]piperazine CHEMBL286991 GBR-13,069
Type:
Small organic molecule
Emp. Form.:
C28H30F2N2O
Mol. Mass.:
448.5474
SMILES:
Fc1ccc(cc1)C(OCCN1CCN(C\C=C\c2ccccc2)CC1)c1ccc(F)cc1
: