Target
Sodium channel protein type 1 subunit alpha
Ligand
BDBM145591
Substrate
Meas. Tech.
ChEMBL_1822227 (CHEMBL4321991)
IC50
6.0±n/a nM
Citation
 Mulcahy, JVPajouhesh, HBeckley, JTDelwig, ADu Bois, JHunter, JC Challenges and Opportunities for Therapeutics Targeting the Voltage-Gated Sodium Channel Isoform Na J Med Chem 62:8695-8710 (2019)  
Target
Name:
Sodium channel protein type 1 subunit alpha
Synonyms:
NAC1 SCN1A Sodium (Site 1) Sodium channel protein type 1 subunit alpha Sodium channel protein type I subunit alpha Voltage-gated sodium channel subunit alpha Nav1.1
Type:
Protein
Mol. Mass.:
228952.47
Organism:
Homo sapiens (Human)
Description:
P35498
Residue:
2009
  
Inhibitor
Name:
BDBM145591
Synonyms:
US8952169, 389
Type:
Small organic molecule
Emp. Form.:
C23H30FNO4S
Mol. Mass.:
435.552
SMILES:
CC1(COc2cc(F)c(cc2C2CC2)C(=O)NS(=O)(=O)C2CC2)CCC2(CC2)CC1
: