Target
Sodium channel protein type 3 subunit alpha
Ligand
BDBM217483
Substrate
Meas. Tech.
ChEMBL_1822229 (CHEMBL4321993)
IC50
>14000±n/a nM
Citation
 Mulcahy, JVPajouhesh, HBeckley, JTDelwig, ADu Bois, JHunter, JC Challenges and Opportunities for Therapeutics Targeting the Voltage-Gated Sodium Channel Isoform Na J Med Chem 62:8695-8710 (2019)  
Target
Name:
Sodium channel protein type 3 subunit alpha
Synonyms:
KIAA1356 NAC3 SCN3A_HUMAN Sodium channel alpha subunits; brain (Types I, II, III) Voltage-gated sodium channel subunit alpha Nav1.3 (Nav1.3)
Type:
Protein
Mol. Mass.:
226276.42
Organism:
Homo sapiens (Human)
Description:
Q9NY46
Residue:
2000
  
Inhibitor
Name:
BDBM217483
Synonyms:
US9212182, 477 | US9212182, 478
Type:
Small organic molecule
Emp. Form.:
C25H16ClF2N3O5S
Mol. Mass.:
543.926
SMILES:
COc1cc(c(F)cc1-n1c2ccc(cc2ccc1=O)S(=O)(=O)Nc1ccon1)-c1cc(F)cc(Cl)c1
: