Target
Sodium channel protein type 3 subunit alpha
Ligand
BDBM50240267
Substrate
Meas. Tech.
ChEMBL_1822229 (CHEMBL4321993)
IC50
11000±n/a nM
Citation
 Mulcahy, JVPajouhesh, HBeckley, JTDelwig, ADu Bois, JHunter, JC Challenges and Opportunities for Therapeutics Targeting the Voltage-Gated Sodium Channel Isoform Na J Med Chem 62:8695-8710 (2019)  
Target
Name:
Sodium channel protein type 3 subunit alpha
Synonyms:
KIAA1356 NAC3 SCN3A_HUMAN Sodium channel alpha subunits; brain (Types I, II, III) Voltage-gated sodium channel subunit alpha Nav1.3 (Nav1.3)
Type:
Protein
Mol. Mass.:
226276.42
Organism:
Homo sapiens (Human)
Description:
Q9NY46
Residue:
2000
  
Inhibitor
Name:
BDBM50240267
Synonyms:
CHEMBL2325014
Type:
Small organic molecule
Emp. Form.:
C18H12Cl2FN5O3S2
Mol. Mass.:
500.354
SMILES:
Nc1[nH]ncc1-c1cc(Cl)ccc1Oc1cc(F)c(cc1Cl)S(=O)(=O)Nc1cscn1
: