Target
Phosphatidylinositol 4,5-bisphosphate 3-kinase catalytic subunit gamma isoform
Ligand
BDBM50505302
Substrate
Meas. Tech.
ChEMBL_1822425 (CHEMBL4322189)
IC50
2.1±n/a nM
Citation
 Lin, SJin, JLiu, YTian, HZhang, YFu, RZhang, JWang, MDu, TJi, MWu, DZhang, KSheng, LLi, YChen, XXu, H Discovery of 4-Methylquinazoline Based PI3K Inhibitors for the Potential Treatment of Idiopathic Pulmonary Fibrosis. J Med Chem 62:8873-8879 (2019)  
Target
Name:
Phosphatidylinositol 4,5-bisphosphate 3-kinase catalytic subunit gamma isoform
Synonyms:
PI3-kinase p110 subunit gamma PI3Kgamma PK3CG_HUMAN Phosphatidylinositol 4,5-bisphosphate 3-kinase (PI3K) Phosphatidylinositol 4,5-bisphosphate 3-kinase catalytic subunit gamma (PI3Kgamma) Phosphatidylinositol 4,5-bisphosphate 3-kinase catalytic subunit gamma isoform (PI3K) Phosphatidylinositol-4,5-bisphosphate 3-kinase catalytic subunit gamma isoform Phosphoinositide 3-kinases gamma (PI3K gamma) p120-PI3K
Type:
Enzyme Subunit
Mol. Mass.:
126470.30
Organism:
Homo sapiens (Human)
Description:
P48736
Residue:
1102
  
Inhibitor
Name:
BDBM50505302
Synonyms:
CHEMBL4527563 | US11534443, Example 44
Type:
Small organic molecule
Emp. Form.:
C26H24F2N4O5S
Mol. Mass.:
542.554
SMILES:
COc1ncc(cc1NS(=O)(=O)c1ccc(F)cc1F)-c1cc(OC2CCOCC2)c2ncnc(C)c2c1
: