Target
Protein mono-ADP-ribosyltransferase PARP6
Ligand
BDBM50505333
Substrate
Meas. Tech.
ChEMBL_1822501 (CHEMBL4322265)
IC50
>10000±n/a nM
Citation
 Buchstaller, HPAnlauf, UDorsch, DKuhn, DLehmann, MLeuthner, BMusil, DRadtki, DRitzert, CRohdich, FSchneider, REsdar, C Discovery and Optimization of 2-Arylquinazolin-4-ones into a Potent and Selective Tankyrase Inhibitor Modulating Wnt Pathway Activity. J Med Chem 62:7897-7909 (2019)  
Target
Name:
Protein mono-ADP-ribosyltransferase PARP6
Synonyms:
ADP-ribosyltransferase diphtheria toxin-like 17 PARP-6 PARP6_HUMAN | Poly [ADP-ribose] polymerase 6
Type:
PROTEIN
Mol. Mass.:
71130.07
Organism:
Homo sapiens (Human)
Description:
ChEMBL_107589
Residue:
630
  
Inhibitor
Name:
BDBM50505333
Synonyms:
CHEMBL4437173
Type:
Small organic molecule
Emp. Form.:
C17H14F2N2O2
Mol. Mass.:
316.3021
SMILES:
CC(C)(O)c1ccc(cc1)-c1nc2c(F)cc(F)cc2c(=O)[nH]1
: