Target
Kappa-type opioid receptor
Ligand
BDBM50057007
Substrate
Meas. Tech.
ChEMBL_145846 (CHEMBL756110)
Ki
>10000±n/a nM
Citation
 Tóth, GDarula, ZPéter, AFülöp, FTourwé, DJaspers, HVerheyden, PBöcskey, ZTóth, ZBorsodi, A Conformationally constrained deltorphin analogs with 2-aminotetralin-2-carboxylic acid in position 3. J Med Chem 40:990-5 (1997)  
Target
Name:
Kappa-type opioid receptor
Synonyms:
KOR-1 OPIATE Kappa Opioid receptor Ror-d
Type:
G Protein-Coupled Receptor (GPCR)
Mol. Mass.:
42692.90
Organism:
Rattus norvegicus (rat)
Description:
P34975
Residue:
380
  
Inhibitor
Name:
BDBM50057007
Synonyms:
4-[(2-{2-[2-Amino-3-(4-hydroxy-phenyl)-propionylamino]-propionylamino}-1,2,3,4-tetrahydro-naphthalene-2-carbonyl)-amino]-4-{1-[1-(carbamoylmethyl-carbamoyl)-2-methyl-butylcarbamoyl]-2-methyl-butylcarbamoyl}-butyric acid | CHEMBL369499
Type:
Small organic molecule
Emp. Form.:
C42H60N8O10
Mol. Mass.:
836.9734
SMILES:
CC[C@H](C)[C@H](NC(=O)[C@@H](NC(=O)[C@H](CCC(O)=O)NC(=O)[C@@]1(CCc2ccccc2C1)NC(=O)[C@@H](C)NC(=O)[C@@H](N)Cc1ccc(O)cc1)[C@@H](C)CC)C(=O)NCC(N)=O
: