Target
BTB/POZ domain-containing protein KCTD12
Ligand
BDBM50505514
Substrate
Meas. Tech.
ChEMBL_1822935 (CHEMBL4322699)
Ki
1430±n/a nM
Citation
 Sereikaite, VFritzius, TKasaragod, VBBader, NMaric, HMSchindelin, HBettler, BStrømgaard, K Targeting the ?-Aminobutyric Acid Type B (GABA J Med Chem 62:8819-8830 (2019)  
Target
Name:
BTB/POZ domain-containing protein KCTD12
Synonyms:
BTB/POZ domain-containing protein KCTD12 KCD12_HUMAN KIAA1778 Pfetin | Predominantly fetal expressed T1 domain
Type:
PROTEIN
Mol. Mass.:
35697.33
Organism:
Homo sapiens
Description:
ChEMBL_119174
Residue:
325
  
Inhibitor
Name:
BDBM50505514
Synonyms:
CHEMBL4538754
Type:
Small organic molecule
Emp. Form.:
C105H154N28O25
Mol. Mass.:
2208.5189
SMILES:
CC[C@H](C)[C@H](NC(=O)[C@@H]1CCCN1C(=O)[C@H](CC(C)C)NC(=O)[C@H](CCC(N)=O)NC(=O)[C@H](CC(C)C)NC(=O)[C@@H](N)CO)C(=O)N[C@@H](CC(C)C)C(=O)N[C@@H](Cc1cnc[nH]1)C(=O)N[C@@H](Cc1cnc[nH]1)C(=O)N[C@@H](C)C(=O)N[C@@H](Cc1ccc(O)cc1)C(=O)N[C@@H](CC(C)C)C(=O)N1CCC[C@H]1C(=O)N[C@@H](CO)C(=O)N[C@@H](CCCNC(N)=N)C(=O)N[C@@H](Cc1cnc[nH]1)C(=O)N[C@@H](Cc1ccc(O)cc1)C(=O)N[C@@H](Cc1ccc(O)cc1)C(O)=O
: