Target
Solute carrier family 22 member 1
Ligand
BDBM94503
Substrate
Meas. Tech.
ChEMBL_1823590 (CHEMBL4323354)
IC50
19360±n/a nM
Citation
 Meyer, MJNeumann, VEFriesacher, HRZdrazil, BBrockmöller, JTzvetkov, MV Opioids as Substrates and Inhibitors of the Genetically Highly Variable Organic Cation Transporter OCT1. J Med Chem 62:9890-9905 (2019)  
Target
Name:
Solute carrier family 22 member 1
Synonyms:
Adrenergic Alpha Organic cation transporter 1 SLC22A1 hOCT1
Type:
Enzyme Catalytic Domain
Mol. Mass.:
61154.85
Organism:
Homo sapiens (Human)
Description:
Adrenergic Alpha 0 HUMAN::O15245
Residue:
554
  
Inhibitor
Name:
BDBM94503
Synonyms:
2-hydroxypropane-1,2,3-tricarboxylic acid;N-[4-(methoxymethyl)-1-(2-thiophen-2-ylethyl)-4-piperidinyl]-N-phenylpropanamide MLS002320668 SMR001338814 Sufentanil citrate cid_65494 | citric acid;N-[4-(methoxymethyl)-1-[2-(2-thienyl)ethyl]-4-piperidyl]-N-phenyl-propionamide
Type:
Small organic molecule
Emp. Form.:
C22H30N2O2S
Mol. Mass.:
386.551
SMILES:
CCC(=O)N(c1ccccc1)C1(COC)CCN(CCc2cccs2)CC1
: