Target
Acetylcholinesterase
Ligand
BDBM50246979
Substrate
Meas. Tech.
ChEMBL_1823687 (CHEMBL4323451)
IC50
>10000±n/a nM
Citation
 Hoffmann, MStiller, CEndres, EScheiner, MGunesch, SSotriffer, CMaurice, TDecker, M Highly Selective Butyrylcholinesterase Inhibitors with Tunable Duration of Action by Chemical Modification of Transferable Carbamate Units Exhibit Pronounced Neuroprotective Effect in an Alzheimer's Disease Mouse Model. J Med Chem 62:9116-9140 (2019)  
Target
Name:
Acetylcholinesterase
Synonyms:
ACES_MOUSE Acetylcholinesterase (mouse AChE) Ache
Type:
Enzyme
Mol. Mass.:
68165.65
Organism:
Mus musculus (mouse)
Description:
Residue:
614
  
Inhibitor
Name:
BDBM50246979
Synonyms:
CHEMBL4105611 | US20230331674, Table 1.1
Type:
Small organic molecule
Emp. Form.:
C26H32N2O3S
Mol. Mass.:
452.609
SMILES:
COCCN(CC1CCCN(Cc2ccccc2)C1)S(=O)(=O)c1ccc2ccccc2c1
: