Target
Cholinesterase
Ligand
BDBM50505681
Substrate
Meas. Tech.
ChEMBL_1823689 (CHEMBL4323453)
IC50
49±n/a nM
Citation
 Hoffmann, MStiller, CEndres, EScheiner, MGunesch, SSotriffer, CMaurice, TDecker, M Highly Selective Butyrylcholinesterase Inhibitors with Tunable Duration of Action by Chemical Modification of Transferable Carbamate Units Exhibit Pronounced Neuroprotective Effect in an Alzheimer's Disease Mouse Model. J Med Chem 62:9116-9140 (2019)  
Target
Name:
Cholinesterase
Synonyms:
Acylcholine acylhydrolase Butyrylcholine esterase (BChE) Butyrylcholinesterase (BuChE) CHLE_HUMAN Cholinesterases Pseudocholinesterase
Type:
Homotetramer
Mol. Mass.:
68422.27
Organism:
Homo sapiens (Human)
Description:
P06276
Residue:
602
  
Inhibitor
Name:
BDBM50505681
Synonyms:
CHEMBL4454960
Type:
Small organic molecule
Emp. Form.:
C28H38N4O3
Mol. Mass.:
478.6263
SMILES:
CN1C2N(CCc3ccccc23)Cc2cc(OC(=O)NCCCCCCN3CCOCC3)ccc12
: