Target
Acetylcholinesterase
Ligand
BDBM11682
Substrate
Meas. Tech.
ChEMBL_1823683 (CHEMBL4323447)
IC50
1535±n/a nM
Citation
 Hoffmann, MStiller, CEndres, EScheiner, MGunesch, SSotriffer, CMaurice, TDecker, M Highly Selective Butyrylcholinesterase Inhibitors with Tunable Duration of Action by Chemical Modification of Transferable Carbamate Units Exhibit Pronounced Neuroprotective Effect in an Alzheimer's Disease Mouse Model. J Med Chem 62:9116-9140 (2019)  
Target
Name:
Acetylcholinesterase
Synonyms:
ACES_HUMAN Acetylcholinesterase (AChE) | Acetylcholinesterase (human AChE)
Type:
Enzyme
Mol. Mass.:
67792.70
Organism:
Homo sapiens (Human)
Description:
P22303
Residue:
614
  
Inhibitor
Name:
BDBM11682
Synonyms:
2,3-dihydroxybutanedioic acid; 3-[(1S)-1-(dimethylamino)ethyl]phenyl N-ethyl-N-methylcarbamate US9586925, Rivastigmine
Type:
Small organic molecule
Emp. Form.:
C14H22N2O2
Mol. Mass.:
250.3367
SMILES:
CCN(C)C(=O)Oc1cccc(c1)[C@H](C)N(C)C
: