Target
Acetylcholinesterase
Ligand
BDBM50505682
Substrate
Meas. Tech.
ChEMBL_1823693 (CHEMBL4323457)
IC50
880±n/a nM
Citation
 Hoffmann, MStiller, CEndres, EScheiner, MGunesch, SSotriffer, CMaurice, TDecker, M Highly Selective Butyrylcholinesterase Inhibitors with Tunable Duration of Action by Chemical Modification of Transferable Carbamate Units Exhibit Pronounced Neuroprotective Effect in an Alzheimer's Disease Mouse Model. J Med Chem 62:9116-9140 (2019)  
Target
Name:
Acetylcholinesterase
Synonyms:
ACES_HUMAN Acetylcholinesterase (AChE) | Acetylcholinesterase (human AChE)
Type:
Enzyme
Mol. Mass.:
67792.70
Organism:
Homo sapiens (Human)
Description:
P22303
Residue:
614
  
Inhibitor
Name:
BDBM50505682
Synonyms:
CHEMBL4583273
Type:
Small organic molecule
Emp. Form.:
C28H38N4O2
Mol. Mass.:
462.6269
SMILES:
CN1C2N(CCc3ccccc23)Cc2cc(OC(=O)NCCCCCCN3CCCC3)ccc12
: