Target
Cholinesterase
Ligand
BDBM50505674
Substrate
Meas. Tech.
ChEMBL_1823689 (CHEMBL4323453)
IC50
7.4±n/a nM
Citation
 Hoffmann, MStiller, CEndres, EScheiner, MGunesch, SSotriffer, CMaurice, TDecker, M Highly Selective Butyrylcholinesterase Inhibitors with Tunable Duration of Action by Chemical Modification of Transferable Carbamate Units Exhibit Pronounced Neuroprotective Effect in an Alzheimer's Disease Mouse Model. J Med Chem 62:9116-9140 (2019)  
Target
Name:
Cholinesterase
Synonyms:
Acylcholine acylhydrolase Butyrylcholine esterase (BChE) Butyrylcholinesterase (BuChE) CHLE_HUMAN Cholinesterases Pseudocholinesterase
Type:
Homotetramer
Mol. Mass.:
68422.27
Organism:
Homo sapiens (Human)
Description:
P06276
Residue:
602
  
Inhibitor
Name:
BDBM50505674
Synonyms:
CHEMBL4458430
Type:
Small organic molecule
Emp. Form.:
C31H35N5O2
Mol. Mass.:
509.6419
SMILES:
CN1C2N(CCc3ccccc23)Cc2cc(OC(=O)NCCCCCCn3cnc4ccccc34)ccc12
: