Target
Acetylcholinesterase
Ligand
BDBM50392999
Substrate
Meas. Tech.
ChEMBL_1823692 (CHEMBL4323456)
IC50
3802±n/a nM
Citation
 Hoffmann, MStiller, CEndres, EScheiner, MGunesch, SSotriffer, CMaurice, TDecker, M Highly Selective Butyrylcholinesterase Inhibitors with Tunable Duration of Action by Chemical Modification of Transferable Carbamate Units Exhibit Pronounced Neuroprotective Effect in an Alzheimer's Disease Mouse Model. J Med Chem 62:9116-9140 (2019)  
Target
Name:
Acetylcholinesterase
Synonyms:
ACES_HUMAN Acetylcholinesterase (AChE) | Acetylcholinesterase (human AChE)
Type:
Enzyme
Mol. Mass.:
67792.70
Organism:
Homo sapiens (Human)
Description:
P22303
Residue:
614
  
Inhibitor
Name:
BDBM50392999
Synonyms:
CHEMBL2152545
Type:
Small organic molecule
Emp. Form.:
C25H33N3O2
Mol. Mass.:
407.5484
SMILES:
CCCCCCCNC(=O)Oc1ccc2N(C)C3N(CCc4ccccc34)Cc2c1
: