Target
Mycocyclosin synthase
Ligand
BDBM50505740
Substrate
Meas. Tech.
ChEMBL_1823748 (CHEMBL4323512)
Kd
80800±n/a nM
Citation
 Rajput, SMcLean, KJPoddar, HSelvam, IRNagalingam, GTriccas, JALevy, CWMunro, AWHutton, CA Structure-Activity Relationships of  J Med Chem 62:9792-9805 (2019)  
Target
Name:
Mycocyclosin synthase
Synonyms:
CP121_MYCTU Cytochrome P450 MT2 | cyp121
Type:
PROTEIN
Mol. Mass.:
43255.98
Organism:
Mycobacterium tuberculosis
Description:
ChEMBL_721243
Residue:
396
  
Inhibitor
Name:
BDBM50505740
Synonyms:
CHEBI:71611 | CHEMBL191426
Type:
Small organic molecule
Emp. Form.:
C18H18N2O3
Mol. Mass.:
310.3471
SMILES:
Oc1ccc(C[C@@H]2NC(=O)[C@H](Cc3ccccc3)NC2=O)cc1
: