Target
Mitogen-activated protein kinase kinase kinase 5
Ligand
BDBM50505940
Substrate
Meas. Tech.
ChEMBL_1824445 (CHEMBL4324209)
IC50
9.0±n/a nM
Citation
 Himmelbauer, MKXin, ZJones, JHEnyedy, IKing, KMarcotte, DJMurugan, PSantoro, JCHesson, TSpilker, KJohnson, JLLuzzio, MJGilfillan, Rde Turiso, FG Rational Design and Optimization of a Novel Class of Macrocyclic Apoptosis Signal-Regulating Kinase 1 Inhibitors. J Med Chem 62:10740-10756 (2019)  
Target
Name:
Mitogen-activated protein kinase kinase kinase 5
Synonyms:
ASK1 MAP3K5 MEKK5
Type:
Protein
Mol. Mass.:
154514.93
Organism:
Homo sapiens (Human)
Description:
Q99683
Residue:
1374
  
Inhibitor
Name:
BDBM50505940
Synonyms:
CHEMBL4449840
Type:
Small organic molecule
Emp. Form.:
C30H27N3O5
Mol. Mass.:
509.5525
SMILES:
COc1cc2nccc(Oc3ccc(NC(=O)c4cn(C(C)C)c5ccccc5c4=O)cc3)c2cc1OC
: