Target
Mitogen-activated protein kinase kinase kinase 5
Ligand
BDBM50023727
Substrate
Meas. Tech.
ChEMBL_1824445 (CHEMBL4324209)
IC50
131±n/a nM
Citation
 Himmelbauer, MKXin, ZJones, JHEnyedy, IKing, KMarcotte, DJMurugan, PSantoro, JCHesson, TSpilker, KJohnson, JLLuzzio, MJGilfillan, Rde Turiso, FG Rational Design and Optimization of a Novel Class of Macrocyclic Apoptosis Signal-Regulating Kinase 1 Inhibitors. J Med Chem 62:10740-10756 (2019)  
Target
Name:
Mitogen-activated protein kinase kinase kinase 5
Synonyms:
ASK1 MAP3K5 MEKK5
Type:
Protein
Mol. Mass.:
154514.93
Organism:
Homo sapiens (Human)
Description:
Q99683
Residue:
1374
  
Inhibitor
Name:
BDBM50023727
Synonyms:
CHEMBL3330170
Type:
Small organic molecule
Emp. Form.:
C16H13F3N6O
Mol. Mass.:
362.3092
SMILES:
FC(F)(F)c1cc(NC2CC2)n2nc(NC(=O)c3cccnc3)nc2c1
: