Target
Mitogen-activated protein kinase kinase kinase 5
Ligand
BDBM524905
Substrate
Meas. Tech.
ChEMBL_1824446 (CHEMBL4324210)
IC50
658±n/a nM
Citation
 Himmelbauer, MKXin, ZJones, JHEnyedy, IKing, KMarcotte, DJMurugan, PSantoro, JCHesson, TSpilker, KJohnson, JLLuzzio, MJGilfillan, Rde Turiso, FG Rational Design and Optimization of a Novel Class of Macrocyclic Apoptosis Signal-Regulating Kinase 1 Inhibitors. J Med Chem 62:10740-10756 (2019)  
Target
Name:
Mitogen-activated protein kinase kinase kinase 5
Synonyms:
ASK1 MAP3K5 MEKK5
Type:
Protein
Mol. Mass.:
154514.93
Organism:
Homo sapiens (Human)
Description:
Q99683
Residue:
1374
  
Inhibitor
Name:
BDBM524905
Synonyms:
BDBM50505947 | US11168095, Example 160
Type:
Small organic molecule
Emp. Form.:
C18H16FN5O2
Mol. Mass.:
353.3503
SMILES:
Fc1ccc2OCCCCn3cnnc3-c3cccc(NC(=O)c2c1)n3
: