Target
Mitogen-activated protein kinase kinase kinase 5
Ligand
BDBM50212258
Substrate
Meas. Tech.
ChEMBL_1824445 (CHEMBL4324209)
IC50
5.9±n/a nM
Citation
 Himmelbauer, MKXin, ZJones, JHEnyedy, IKing, KMarcotte, DJMurugan, PSantoro, JCHesson, TSpilker, KJohnson, JLLuzzio, MJGilfillan, Rde Turiso, FG Rational Design and Optimization of a Novel Class of Macrocyclic Apoptosis Signal-Regulating Kinase 1 Inhibitors. J Med Chem 62:10740-10756 (2019)  
Target
Name:
Mitogen-activated protein kinase kinase kinase 5
Synonyms:
ASK1 MAP3K5 MEKK5
Type:
Protein
Mol. Mass.:
154514.93
Organism:
Homo sapiens (Human)
Description:
Q99683
Residue:
1374
  
Inhibitor
Name:
BDBM50212258
Synonyms:
GS-4997 | Selonsertib
Type:
Small organic molecule
Emp. Form.:
C24H24FN7O
Mol. Mass.:
445.4921
SMILES:
CC(C)n1cnnc1-c1cccc(NC(=O)c2cc(c(C)cc2F)-n2cnc(c2)C2CC2)n1
: