Target
Mitogen-activated protein kinase kinase kinase 5
Ligand
BDBM50505959
Substrate
Meas. Tech.
ChEMBL_1824445 (CHEMBL4324209)
IC50
13±n/a nM
Citation
 Himmelbauer, MKXin, ZJones, JHEnyedy, IKing, KMarcotte, DJMurugan, PSantoro, JCHesson, TSpilker, KJohnson, JLLuzzio, MJGilfillan, Rde Turiso, FG Rational Design and Optimization of a Novel Class of Macrocyclic Apoptosis Signal-Regulating Kinase 1 Inhibitors. J Med Chem 62:10740-10756 (2019)  
Target
Name:
Mitogen-activated protein kinase kinase kinase 5
Synonyms:
ASK1 MAP3K5 MEKK5
Type:
Protein
Mol. Mass.:
154514.93
Organism:
Homo sapiens (Human)
Description:
Q99683
Residue:
1374
  
Inhibitor
Name:
BDBM50505959
Synonyms:
CHEMBL4442116 | US11168095, Example 89
Type:
Small organic molecule
Emp. Form.:
C19H19N5O2
Mol. Mass.:
349.3865
SMILES:
C[C@@H]1CCn2cnnc2-c2cccc(NC(=O)c3ccccc3OC1)n2
: