Target
Mitogen-activated protein kinase kinase kinase 5
Ligand
BDBM50505955
Substrate
Meas. Tech.
ChEMBL_1824445 (CHEMBL4324209)
IC50
28±n/a nM
Citation
 Himmelbauer, MKXin, ZJones, JHEnyedy, IKing, KMarcotte, DJMurugan, PSantoro, JCHesson, TSpilker, KJohnson, JLLuzzio, MJGilfillan, Rde Turiso, FG Rational Design and Optimization of a Novel Class of Macrocyclic Apoptosis Signal-Regulating Kinase 1 Inhibitors. J Med Chem 62:10740-10756 (2019)  
Target
Name:
Mitogen-activated protein kinase kinase kinase 5
Synonyms:
ASK1 MAP3K5 MEKK5
Type:
Protein
Mol. Mass.:
154514.93
Organism:
Homo sapiens (Human)
Description:
Q99683
Residue:
1374
  
Inhibitor
Name:
BDBM50505955
Synonyms:
CHEMBL4544934 | US11168095, Example 4
Type:
Small organic molecule
Emp. Form.:
C23H24N6O3
Mol. Mass.:
432.4751
SMILES:
O=C1Nc2cccc(n2)-c2nncn2CCCCOc2ccc(cc12)N1CC2(COC2)C1
: