Target
Mitogen-activated protein kinase kinase kinase 5
Ligand
BDBM50505957
Substrate
Meas. Tech.
ChEMBL_1824445 (CHEMBL4324209)
IC50
8.0±n/a nM
Citation
 Himmelbauer, MKXin, ZJones, JHEnyedy, IKing, KMarcotte, DJMurugan, PSantoro, JCHesson, TSpilker, KJohnson, JLLuzzio, MJGilfillan, Rde Turiso, FG Rational Design and Optimization of a Novel Class of Macrocyclic Apoptosis Signal-Regulating Kinase 1 Inhibitors. J Med Chem 62:10740-10756 (2019)  
Target
Name:
Mitogen-activated protein kinase kinase kinase 5
Synonyms:
ASK1 MAP3K5 MEKK5
Type:
Protein
Mol. Mass.:
154514.93
Organism:
Homo sapiens (Human)
Description:
Q99683
Residue:
1374
  
Inhibitor
Name:
BDBM50505957
Synonyms:
CHEMBL4591648
Type:
Small organic molecule
Emp. Form.:
C26H29FN8O2
Mol. Mass.:
504.5593
SMILES:
C[C@@H]1CCOc2cc(F)c(cc2C(=O)Nc2cccc(n2)-c2nncn2C1)-c1cnn(CCN(C)C)c1
: