Target
Mitogen-activated protein kinase kinase kinase 5
Ligand
BDBM50505960
Substrate
Meas. Tech.
ChEMBL_1824445 (CHEMBL4324209)
IC50
6.0±n/a nM
Citation
 Himmelbauer, MKXin, ZJones, JHEnyedy, IKing, KMarcotte, DJMurugan, PSantoro, JCHesson, TSpilker, KJohnson, JLLuzzio, MJGilfillan, Rde Turiso, FG Rational Design and Optimization of a Novel Class of Macrocyclic Apoptosis Signal-Regulating Kinase 1 Inhibitors. J Med Chem 62:10740-10756 (2019)  
Target
Name:
Mitogen-activated protein kinase kinase kinase 5
Synonyms:
ASK1 MAP3K5 MEKK5
Type:
Protein
Mol. Mass.:
154514.93
Organism:
Homo sapiens (Human)
Description:
Q99683
Residue:
1374
  
Inhibitor
Name:
BDBM50505960
Synonyms:
CHEMBL4456722 | US11168095, Example 39
Type:
Small organic molecule
Emp. Form.:
C25H28N8O2
Mol. Mass.:
472.5422
SMILES:
CN(C)CCn1cc(cn1)-c1ccc2OCCCCn3cnnc3-c3cccc(NC(=O)c2c1)n3
: