Target
Mitogen-activated protein kinase 1
Ligand
BDBM50094464
Substrate
Meas. Tech.
ChEMBL_1824543 (CHEMBL4324307)
Kd
0.050119±n/a nM
Citation
 Ward, RAAnderton, MJBethel, PBreed, JCook, CDavies, EJDobson, ADong, ZFairley, GFarrington, PFeron, LFlemington, VGibbons, FDGraham, MAGreenwood, RHanson, LHopcroft, PHowells, RHudson, JJames, MJones, CDJones, CRLi, YLamont, SLewis, RLindsay, NMcCabe, JMcGuire, TRawlins, PRoberts, KSandin, LSimpson, ISwallow, STang, JTomkinson, GTonge, MWang, ZZhai, B Discovery of a Potent and Selective Oral Inhibitor of ERK1/2 (AZD0364) That Is Efficacious in Both Monotherapy and Combination Therapy in Models of Nonsmall Cell Lung Cancer (NSCLC). J Med Chem 62:11004-11018 (2019)  
Target
Name:
Mitogen-activated protein kinase 1
Synonyms:
ERK2 Extracellular signal-regulated kinase 2 Extracellular signal-regulated kinase 2 (ERK2) MAPK 2 MK01_HUMAN Mitogen-activated protein kinase 1 (ERK-2) Mitogen-activated protein kinase 2 PRKM2 | p42-MAPK
Type:
Ser/Thr Protein Kinase
Mol. Mass.:
41392.76
Organism:
Homo sapiens (Human)
Description:
P28482
Residue:
360
  
Inhibitor
Name:
BDBM50094464
Synonyms:
CHEMBL3590107 US10934304, Example SCH772984
Type:
Small organic molecule
Emp. Form.:
C33H33N9O2
Mol. Mass.:
587.6742
SMILES:
O=C(CN1CC[C@H](C1)C(=O)Nc1ccc2[nH]nc(-c3ccncc3)c2c1)N1CCN(CC1)c1ccc(cc1)-c1ncccn1
: