Target
Sigma non-opioid intracellular receptor 1
Ligand
BDBM50058015
Substrate
Meas. Tech.
ChEMBL_202076 (CHEMBL811508)
Ki
3.6±n/a nM
Citation
 Waterhouse, RNMardon, KGiles, KMCollier, TLO'Brien, JC Halogenated 4-(phenoxymethyl)piperidines as potential radiolabeled probes for sigma-1 receptors: in vivo evaluation of [123I]-1-(iodopropen-2-yl)-4-[(4-cyanophenoxy)methyl]pip eri dine. J Med Chem 40:1657-67 (1997)  
Target
Name:
Sigma non-opioid intracellular receptor 1
Synonyms:
Opioid receptor SGMR1_RAT Sigma non-opioid intracellular receptor 1 Sigma-1 | Sigmar1
Type:
Enzyme Catalytic Domain
Mol. Mass.:
25266.54
Organism:
RAT
Description:
Q9R0C9
Residue:
223
  
Inhibitor
Name:
BDBM50058015
Synonyms:
1-(4-Fluoro-benzyl)-4-pentafluorophenyloxymethyl-piperidine | CHEMBL287876
Type:
Small organic molecule
Emp. Form.:
C19H17F6NO
Mol. Mass.:
389.3348
SMILES:
Fc1ccc(CN2CCC(COc3c(F)c(F)c(F)c(F)c3F)CC2)cc1
: