Target
D(2) dopamine receptor
Ligand
BDBM50058018
Substrate
Meas. Tech.
ChEMBL_61132 (CHEMBL670745)
Ki
>10000±n/a nM
Citation
 Waterhouse, RNMardon, KGiles, KMCollier, TLO'Brien, JC Halogenated 4-(phenoxymethyl)piperidines as potential radiolabeled probes for sigma-1 receptors: in vivo evaluation of [123I]-1-(iodopropen-2-yl)-4-[(4-cyanophenoxy)methyl]pip eri dine. J Med Chem 40:1657-67 (1997)  
Target
Name:
D(2) dopamine receptor
Synonyms:
D(2) dopamine receptor DOPAMINE D2 Long DRD2 Dopamine D2 receptor Dopamine D2 receptor (D2R) Dopamine2-like | d2
Type:
Cell-surface receptors
Mol. Mass.:
50647.10
Organism:
Homo sapiens (Human)
Description:
P14416
Residue:
443
  
Inhibitor
Name:
BDBM50058018
Synonyms:
2-[4-(4-Iodo-phenoxymethyl)-piperidin-1-yl]-ethanol | CHEMBL46374
Type:
Small organic molecule
Emp. Form.:
C14H20INO2
Mol. Mass.:
361.2186
SMILES:
OCCN1CCC(COc2ccc(I)cc2)CC1
: