Target
D(2) dopamine receptor
Ligand
BDBM50058017
Substrate
Meas. Tech.
ChEMBL_61132 (CHEMBL670745)
Ki
>10000±n/a nM
Citation
 Waterhouse, RNMardon, KGiles, KMCollier, TLO'Brien, JC Halogenated 4-(phenoxymethyl)piperidines as potential radiolabeled probes for sigma-1 receptors: in vivo evaluation of [123I]-1-(iodopropen-2-yl)-4-[(4-cyanophenoxy)methyl]pip eri dine. J Med Chem 40:1657-67 (1997)  
Target
Name:
D(2) dopamine receptor
Synonyms:
D(2) dopamine receptor DOPAMINE D2 Long DRD2 Dopamine D2 receptor Dopamine D2 receptor (D2R) Dopamine2-like | d2
Type:
Cell-surface receptors
Mol. Mass.:
50647.10
Organism:
Homo sapiens (Human)
Description:
P14416
Residue:
443
  
Inhibitor
Name:
BDBM50058017
Synonyms:
4-[1-(3-Fluoro-propyl)-piperidin-4-ylmethoxy]-benzonitrile CHEMBL417001
Type:
Small organic molecule
Emp. Form.:
C16H21FN2O
Mol. Mass.:
276.3491
SMILES:
FCCCN1CCC(COc2ccc(cc2)C#N)CC1
: