Target
Sigma non-opioid intracellular receptor 1
Ligand
BDBM50002257
Substrate
Meas. Tech.
ChEMBL_201906 (CHEMBL808197)
Ki
10±n/a nM
Citation
 Waterhouse, RNMardon, KGiles, KMCollier, TLO'Brien, JC Halogenated 4-(phenoxymethyl)piperidines as potential radiolabeled probes for sigma-1 receptors: in vivo evaluation of [123I]-1-(iodopropen-2-yl)-4-[(4-cyanophenoxy)methyl]pip eri dine. J Med Chem 40:1657-67 (1997)  
Target
Name:
Sigma non-opioid intracellular receptor 1
Synonyms:
Aging-associated gene 8 protein SGMR1_HUMAN SIGMAR1 SR31747-binding protein Sigma 1-type opioid receptor Sigma1R | hSigmaR1
Type:
Enzyme Catalytic Domain
Mol. Mass.:
25124.85
Organism:
Homo sapiens (Human)
Description:
Q99720
Residue:
223
  
Inhibitor
Name:
BDBM50002257
Synonyms:
4-(1-Cyclopropylmethyl-piperidin-4-ylmethoxy)-benzonitrile | CHEMBL46463
Type:
Small organic molecule
Emp. Form.:
C17H22N2O
Mol. Mass.:
270.3694
SMILES:
N#Cc1ccc(OCC2CCN(CC3CC3)CC2)cc1
: