Target
Sigma non-opioid intracellular receptor 1
Ligand
BDBM50058018
Substrate
Meas. Tech.
ChEMBL_202076 (CHEMBL811508)
Ki
2.3±n/a nM
Citation
 Waterhouse, RNMardon, KGiles, KMCollier, TLO'Brien, JC Halogenated 4-(phenoxymethyl)piperidines as potential radiolabeled probes for sigma-1 receptors: in vivo evaluation of [123I]-1-(iodopropen-2-yl)-4-[(4-cyanophenoxy)methyl]pip eri dine. J Med Chem 40:1657-67 (1997)  
Target
Name:
Sigma non-opioid intracellular receptor 1
Synonyms:
Opioid receptor SGMR1_RAT Sigma non-opioid intracellular receptor 1 Sigma-1 | Sigmar1
Type:
Enzyme Catalytic Domain
Mol. Mass.:
25266.54
Organism:
RAT
Description:
Q9R0C9
Residue:
223
  
Inhibitor
Name:
BDBM50058018
Synonyms:
2-[4-(4-Iodo-phenoxymethyl)-piperidin-1-yl]-ethanol | CHEMBL46374
Type:
Small organic molecule
Emp. Form.:
C14H20INO2
Mol. Mass.:
361.2186
SMILES:
OCCN1CCC(COc2ccc(I)cc2)CC1
: