Target
Sigma non-opioid intracellular receptor 1
Ligand
BDBM50058021
Substrate
Meas. Tech.
ChEMBL_202076 (CHEMBL811508)
Ki
>1000±n/a nM
Citation
 Waterhouse, RNMardon, KGiles, KMCollier, TLO'Brien, JC Halogenated 4-(phenoxymethyl)piperidines as potential radiolabeled probes for sigma-1 receptors: in vivo evaluation of [123I]-1-(iodopropen-2-yl)-4-[(4-cyanophenoxy)methyl]pip eri dine. J Med Chem 40:1657-67 (1997)  
Target
Name:
Sigma non-opioid intracellular receptor 1
Synonyms:
Opioid receptor SGMR1_RAT Sigma non-opioid intracellular receptor 1 Sigma-1 | Sigmar1
Type:
Enzyme Catalytic Domain
Mol. Mass.:
25266.54
Organism:
RAT
Description:
Q9R0C9
Residue:
223
  
Inhibitor
Name:
BDBM50058021
Synonyms:
1-Pentafluorophenylmethyl-4-pentafluorophenyloxymethyl-piperidine | CHEMBL296439
Type:
Small organic molecule
Emp. Form.:
C19H13F10NO
Mol. Mass.:
461.2967
SMILES:
Fc1c(F)c(F)c(CN2CCC(COc3c(F)c(F)c(F)c(F)c3F)CC2)c(F)c1F
: