Target
Sigma non-opioid intracellular receptor 1
Ligand
BDBM50058022
Substrate
Meas. Tech.
ChEMBL_202076 (CHEMBL811508)
Ki
1.7±n/a nM
Citation
 Waterhouse, RNMardon, KGiles, KMCollier, TLO'Brien, JC Halogenated 4-(phenoxymethyl)piperidines as potential radiolabeled probes for sigma-1 receptors: in vivo evaluation of [123I]-1-(iodopropen-2-yl)-4-[(4-cyanophenoxy)methyl]pip eri dine. J Med Chem 40:1657-67 (1997)  
Target
Name:
Sigma non-opioid intracellular receptor 1
Synonyms:
Opioid receptor SGMR1_RAT Sigma non-opioid intracellular receptor 1 Sigma-1 | Sigmar1
Type:
Enzyme Catalytic Domain
Mol. Mass.:
25266.54
Organism:
RAT
Description:
Q9R0C9
Residue:
223
  
Inhibitor
Name:
BDBM50058022
Synonyms:
1-(3-Fluoro-propyl)-4-pentafluorophenyloxymethyl-piperidine | CHEMBL44304
Type:
Small organic molecule
Emp. Form.:
C15H17F6NO
Mol. Mass.:
341.292
SMILES:
FCCCN1CCC(COc2c(F)c(F)c(F)c(F)c2F)CC1
: