Target
C-C chemokine receptor type 2
Ligand
BDBM50506150
Substrate
Meas. Tech.
ChEMBL_1824953 (CHEMBL4324717)
Ki
4.1±n/a nM
Citation
 Ortiz Zacarķas, NVvan Veldhoven, JPDden Hollander, LSDogan, BOpeny, JHsiao, YYLenselink, EBHeitman, LHIJzerman, AP Synthesis and Pharmacological Evaluation of Triazolopyrimidinone Derivatives as Noncompetitive, Intracellular Antagonists for CC Chemokine Receptors 2 and 5. J Med Chem 62:11035-11053 (2019)  
Target
Name:
C-C chemokine receptor type 2
Synonyms:
C-C chemokine receptor type 2 (CCR2) CCR2_HUMAN Chemoattractant Cytokine Receptor 2 (CCR2) Monocyte chemotactic protein-1 (MCP-1)
Type:
Enzyme
Mol. Mass.:
41932.32
Organism:
Homo sapiens (Human)
Description:
P41597
Residue:
374
  
Inhibitor
Name:
BDBM50506150
Synonyms:
CHEMBL4448714
Type:
Small organic molecule
Emp. Form.:
C15H14FN5O
Mol. Mass.:
299.303
SMILES:
Nc1nc2[nH]c(C3CC3)c(Cc3ccc(F)cc3)c(=O)n2n1
: