Target
Hepatic triacylglycerol lipase
Ligand
BDBM50506505
Substrate
Meas. Tech.
ChEMBL_1825989 (CHEMBL4325753)
IC50
4.0±n/a nM
Citation
 Tora, GKim, SHPi, ZJohnson, JAJiang, JPhillips, MLloyd, JAbell, LMLu, HLocke, GAdam, LPTaylor, DSYin, XBehnia, KZhao, LYang, RBasso, MCaporuscio, CChen, AYLiu, EKirshgessner, TOnorato, JMRyan, CTraeger, SCGordon, DWexler, RRFinlay, HJ Identification of Reversible Small Molecule Inhibitors of Endothelial Lipase (EL) That Demonstrate HDL-C Increase In Vivo. J Med Chem 63:1660-1670 (2020)  
Target
Name:
Hepatic triacylglycerol lipase
Synonyms:
HL Hepatic Lipase (HL) Hepatic triacylglycerol lipase LIPC_HUMAN | Lipase member C
Type:
Protein
Mol. Mass.:
55938.55
Organism:
Homo sapiens (Human)
Description:
P11150
Residue:
499
  
Inhibitor
Name:
BDBM50506505
Synonyms:
CHEMBL4460376
Type:
Small organic molecule
Emp. Form.:
C20H14F4N6O5S2
Mol. Mass.:
558.486
SMILES:
NS(=O)(=O)NCc1nnc(o1)C(=O)c1nc2cc(c(F)cc2s1)-c1ccc(cc1)C(=O)NCC(F)(F)F
: