Target
Hepatic triacylglycerol lipase
Ligand
BDBM187290
Substrate
Meas. Tech.
ChEMBL_1825989 (CHEMBL4325753)
IC50
5.0±n/a nM
Citation
 Tora, GKim, SHPi, ZJohnson, JAJiang, JPhillips, MLloyd, JAbell, LMLu, HLocke, GAdam, LPTaylor, DSYin, XBehnia, KZhao, LYang, RBasso, MCaporuscio, CChen, AYLiu, EKirshgessner, TOnorato, JMRyan, CTraeger, SCGordon, DWexler, RRFinlay, HJ Identification of Reversible Small Molecule Inhibitors of Endothelial Lipase (EL) That Demonstrate HDL-C Increase In Vivo. J Med Chem 63:1660-1670 (2020)  
Target
Name:
Hepatic triacylglycerol lipase
Synonyms:
HL Hepatic Lipase (HL) Hepatic triacylglycerol lipase LIPC_HUMAN | Lipase member C
Type:
Protein
Mol. Mass.:
55938.55
Organism:
Homo sapiens (Human)
Description:
P11150
Residue:
499
  
Inhibitor
Name:
BDBM187290
Synonyms:
US9169240, 30
Type:
Small organic molecule
Emp. Form.:
C19H16N6O6S2
Mol. Mass.:
488.497
SMILES:
COC(=O)Nc1ccc(cc1)-c1ccc2nc(sc2c1)C(=O)c1nnc(CNS(N)(=O)=O)o1
: