Target
Prostaglandin E2 receptor EP2 subtype
Ligand
BDBM50506548
Substrate
Meas. Tech.
ChEMBL_1826276 (CHEMBL4326150)
Ki
433±n/a nM
Citation
 Iwamura, RTanaka, MOkanari, EKirihara, TOdani-Kawabata, NShams, NYoneda, K Identification of a Selective, Non-Prostanoid EP2 Receptor Agonist for the Treatment of Glaucoma: Omidenepag and its Prodrug Omidenepag Isopropyl. J Med Chem 61:6869-6891 (2018)  
Target
Name:
Prostaglandin E2 receptor EP2 subtype
Synonyms:
PE2R2_HUMAN PTGER2 Prostaglandin E2 receptor Prostanoid EP2 Receptor
Type:
Enzyme
Mol. Mass.:
39775.71
Organism:
Homo sapiens (Human)
Description:
P43116
Residue:
358
  
Inhibitor
Name:
BDBM50506548
Synonyms:
CHEMBL4448995
Type:
Small organic molecule
Emp. Form.:
C26H26N2O5S
Mol. Mass.:
478.56
SMILES:
CC(C)(C)c1ccc(CN(Cc2ccc3cc(oc3c2)C(O)=O)S(=O)(=O)c2cccnc2)cc1
: