Target
Prostaglandin E2 receptor EP2 subtype
Ligand
BDBM180008
Substrate
Meas. Tech.
ChEMBL_1826277 (CHEMBL4326151)
EC50
75±n/a nM
Citation
 Iwamura, RTanaka, MOkanari, EKirihara, TOdani-Kawabata, NShams, NYoneda, K Identification of a Selective, Non-Prostanoid EP2 Receptor Agonist for the Treatment of Glaucoma: Omidenepag and its Prodrug Omidenepag Isopropyl. J Med Chem 61:6869-6891 (2018)  
Target
Name:
Prostaglandin E2 receptor EP2 subtype
Synonyms:
PE2R2_HUMAN PTGER2 Prostaglandin E2 receptor Prostanoid EP2 Receptor
Type:
Enzyme
Mol. Mass.:
39775.71
Organism:
Homo sapiens (Human)
Description:
P43116
Residue:
358
  
Inhibitor
Name:
BDBM180008
Synonyms:
US9676720, Comparative example 4
Type:
Small organic molecule
Emp. Form.:
C26H23ClN4O4S
Mol. Mass.:
523.003
SMILES:
OC(=O)CNc1cccc(CN(Cc2ccc(cc2)-c2ccc(Cl)cc2)S(=O)(=O)c2cccnc2)n1
: