Target
Prostaglandin E2 receptor EP4 subtype
Ligand
BDBM50506549
Substrate
Meas. Tech.
ChEMBL_1826280 (CHEMBL4326154)
IC50
>10000±n/a nM
Citation
 Iwamura, RTanaka, MOkanari, EKirihara, TOdani-Kawabata, NShams, NYoneda, K Identification of a Selective, Non-Prostanoid EP2 Receptor Agonist for the Treatment of Glaucoma: Omidenepag and its Prodrug Omidenepag Isopropyl. J Med Chem 61:6869-6891 (2018)  
Target
Name:
Prostaglandin E2 receptor EP4 subtype
Synonyms:
PE2R4_HUMAN PGE2 receptor EP4 subtype PTGER4 Prostanoid EP4 receptor
Type:
Enzyme
Mol. Mass.:
53134.53
Organism:
Homo sapiens (Human)
Description:
P35408
Residue:
488
  
Inhibitor
Name:
BDBM50506549
Synonyms:
De-117 | Omidenepag isopropyl
Type:
Small organic molecule
Emp. Form.:
C26H28N6O4S
Mol. Mass.:
520.603
SMILES:
CC(C)OC(=O)CNc1cccc(CN(Cc2ccc(cc2)-n2cccn2)S(=O)(=O)c2cccnc2)n1
: